Reaction Details
TargetSolute carrier family 22 member 1
LigandBDBM50017679
Substrate/Competitorn/a
Meas. Tech.ChEMBL_838699 (CHEMBL2078481)
IC50 2720±n/a nM
Citation Hayer-Zillgen, MBrüss, MBönisch, H Expression and pharmacological profile of the human organic cation transporters hOCT1, hOCT2 and hOCT3. Br J Pharmacol136:829-36 (2002) 
 
Solute carrier family 22 member 1
Name:Solute carrier family 22 member 1
Type:Enzyme Catalytic Domain
Mol. Mass.:61154.85
Organism:Homo sapiens (Human)
Description:Adrenergic Alpha 0 HUMAN::O15245
Residue:554
BDBM50017679
NameBDBM50017679
Synonyms:Benzyl-(2-chloro-ethyl)-(1-methyl-2-phenoxy-ethyl)-amine Dibenzyline | PHENOXYBENZAMINE
TypeSmall organic molecule
Emp. Form.C18H22ClNO
Mol. Mass.303.826
SMILESCC(COc1ccccc1)N(CCCl)Cc1ccccc1