Reaction Details
TargetSolute carrier family 22 member 1
LigandBDBM50420179
Substrate/Competitorn/a
Meas. Tech.ChEMBL_836295 (CHEMBL2076308)
Ki 102000±n/a nM
Citation Dresser, MJGray, ATGiacomini, KM Kinetic and selectivity differences between rodent, rabbit, and human organic cation transporters (OCT1). J Pharmacol Exp Ther292:1146-52 (2000) Solute carrier family 22 member 1
Name:Solute carrier family 22 member 1
Type:Enzyme Catalytic Domain
Mol. Mass.:61154.85
Organism:Homo sapiens (Human)
Description:Adrenergic Alpha 0 HUMAN::O15245
Residue:554
BDBM50420179
NameBDBM50420179
Synonyms:CHEMBL2074857
TypeSmall organic molecule
Emp. Form.C12H28N
Mol. Mass.186.3569
SMILESCCC[N+](CCC)(CCC)CCC