Reaction Details
TargetSolute carrier family 22 member 2
LigandBDBM50420177
Substrate/Competitorn/a
Meas. Tech.ChEMBL_835924 (CHEMBL2077062)
IC50 13661000±n/a nM
Citation Kakehi, MKoyabu, NNakamura, TUchiumi, TKuwano, MOhtani, HSawada, Y Functional characterization of mouse cation transporter mOCT2 compared with mOCT1. Biochem Biophys Res Commun296:644-50 (2002) Solute carrier family 22 member 2
Name:Solute carrier family 22 member 2
Type:PROTEIN
Mol. Mass.:61838.23
Organism:Mus musculus
Description:ChEMBL_835924
Residue:553
BDBM50420177
NameBDBM50420177
Synonyms:NICOTINYL METHYLAMIDE
TypeSmall organic molecule
Emp. Form.C7H8N2O
Mol. Mass.136.1512
SMILESCNC(=O)c1cccnc1