Reaction Details
TargetSolute carrier family 22 member 1
LigandBDBM50026220
Substrate/Competitorn/a
Meas. Tech.ChEMBL_835933 (CHEMBL2077071)
IC50 55000±n/a nM
Citation Kakehi, MKoyabu, NNakamura, TUchiumi, TKuwano, MOhtani, HSawada, Y Functional characterization of mouse cation transporter mOCT2 compared with mOCT1. Biochem Biophys Res Commun296:644-50 (2002) Solute carrier family 22 member 1
Name:Solute carrier family 22 member 1
Type:PROTEIN
Mol. Mass.:61521.43
Organism:Mus musculus
Description:ChEMBL_1279071
Residue:556
BDBM50026220
NameBDBM50026220
Synonyms:2-hydroxy-N,N,N-trimethylethanaminium CHEMBL293410 N-trimethylethanolamine choline | trimethylethanolamine
TypeSmall organic molecule
Emp. Form.C5H14NO
Mol. Mass.104.1702
SMILESC[N+](C)(C)CCO