Reaction Details
TargetSolute carrier family 22 member 8
LigandBDBM50003019
Substrate/Competitorn/a
Meas. Tech.ChEMBL_836126 (CHEMBL2077562)
Ki 3700±n/a nM
Citation Takeda, MNarikawa, SHosoyamada, MCha, SHSekine, TEndou, H Characterization of organic anion transport inhibitors using cells stably expressing human organic anion transporters. Eur J Pharmacol419:113-20 (2001) Solute carrier family 22 member 8
Name:Solute carrier family 22 member 8
Type:PROTEIN
Mol. Mass.:59870.13
Organism:Homo sapiens (Human)
Description:ChEMBL_1486920
Residue:542
BDBM50003019
NameBDBM50003019
Synonyms:8-(Hexahydro-2,5-methano-pentalen-3a-yl)-1,3-dipropyl-3,7-dihydro-purine-2,6-dione KW-3902
TypeSmall organic molecule
Emp. Form.C20H28N4O2
Mol. Mass.356.4619
SMILESCCCn1c2nc([nH]c2c(=O)n(CCC)c1=O)C12CC3CC1CC(C2)C3