Reaction Details
TargetSolute carrier family 22 member 11
LigandBDBM50370587
Substrate/Competitorn/a
Meas. Tech.ChEMBL_838708 (CHEMBL2078490)
Ki 1740±n/a nM
Citation Takeda, MBabu, ENarikawa, SEndou, H Interaction of human organic anion transporters with various cephalosporin antibiotics. Eur J Pharmacol438:137-42 (2002) Solute carrier family 22 member 11
Name:Solute carrier family 22 member 11
Type:PROTEIN
Mol. Mass.:59982.54
Organism:Homo sapiens (Human)
Description:ChEMBL_838708
Residue:550
BDBM50370587
NameBDBM50370587
Synonyms:CEFAZOLIN
TypeSmall organic molecule
Emp. Form.C14H14N8O4S3
Mol. Mass.454.507
SMILESCc1nnc(SCC2=C(N3[C@H](SC2)[C@H](NC(=O)Cn2cnnn2)C3=O)C(O)=O)s1