Reaction Details
TargetSolute carrier family 22 member 1
LigandBDBM50420217
Substrate/Competitorn/a
Meas. Tech.ChEMBL_838298 (CHEMBL2076246)
IC50 37000±n/a nM
Citation Arndt, PVolk, CGorboulev, VBudiman, TPopp, CUlzheimer-Teuber, IAkhoundova, AKoppatz, SBamberg, ENagel, GKoepsell, H Interaction of cations, anions, and weak base quinine with rat renal cation transporter rOCT2 compared with rOCT1. Am J Physiol Renal Physiol281:454-68 (2001) 
 
Solute carrier family 22 member 1
Name:Solute carrier family 22 member 1
Type:Enzyme Catalytic Domain
Mol. Mass.:61538.40
Organism:RAT
Description:Adrenaline alpha1 0 RAT::Q63089
Residue:556
BDBM50420217
NameBDBM50420217
Synonyms:METIPRENALINE
TypeSmall organic molecule
Emp. Form.C12H19NO3
Mol. Mass.225.2842
SMILESCOc1cc(ccc1O)C(O)CNC(C)C