Reaction Details
TargetSolute carrier family 22 member 2
LigandBDBM50416487
Substrate/Competitorn/a
Meas. Tech.ChEMBL_838772 (CHEMBL2078598)
Ki 12000±n/a nM
Citation Arndt, PVolk, CGorboulev, VBudiman, TPopp, CUlzheimer-Teuber, IAkhoundova, AKoppatz, SBamberg, ENagel, GKoepsell, H Interaction of cations, anions, and weak base quinine with rat renal cation transporter rOCT2 compared with rOCT1. Am J Physiol Renal Physiol281:454-68 (2001) 
 
Solute carrier family 22 member 2
Name:Solute carrier family 22 member 2
Type:Enzyme Catalytic Domain
Mol. Mass.:62348.38
Organism:RAT
Description:Adrenaline alpha2 0 RAT::Q9R0W2
Residue:555
BDBM50416487
NameBDBM50416487
Synonyms:CHEMBL1236196 | TETRABUTYLAMMONIUM
TypeSmall organic molecule
Emp. Form.C16H36N
Mol. Mass.242.4632
SMILESCCCC[N+](CCCC)(CCCC)CCCC