Reaction Details
TargetSolute carrier family 22 member 2
LigandBDBM50420179
Substrate/Competitorn/a
Meas. Tech.ChEMBL_838297 (CHEMBL2076245)
IC50 6200±n/a nM
Citation Arndt, PVolk, CGorboulev, VBudiman, TPopp, CUlzheimer-Teuber, IAkhoundova, AKoppatz, SBamberg, ENagel, GKoepsell, H Interaction of cations, anions, and weak base quinine with rat renal cation transporter rOCT2 compared with rOCT1. Am J Physiol Renal Physiol281:454-68 (2001) 
 
Solute carrier family 22 member 2
Name:Solute carrier family 22 member 2
Type:Enzyme Catalytic Domain
Mol. Mass.:62348.38
Organism:RAT
Description:Adrenaline alpha2 0 RAT::Q9R0W2
Residue:555
BDBM50420179
NameBDBM50420179
Synonyms:CHEMBL2074857
TypeSmall organic molecule
Emp. Form.C12H28N
Mol. Mass.186.3569
SMILESCCC[N+](CCC)(CCC)CCC