Reaction Details
TargetSolute carrier family 15 member 1
LigandBDBM50370589
Substrate/Competitorn/a
Meas. Tech.ChEMBL_838254 (CHEMBL2076202)
Ki 12300000±n/a nM
Citation Luckner, PBrandsch, M Interaction of 31 beta-lactam antibiotics with the H+/peptide symporter PEPT2: analysis of affinity constants and comparison with PEPT1. Eur J Pharm Biopharm59:17-24 (2004) 
 
Solute carrier family 15 member 1
Name:Solute carrier family 15 member 1
Type:PROTEIN
Mol. Mass.:78818.07
Organism:Homo sapiens (Human)
Description:ChEMBL_1488839
Residue:708
BDBM50370589
NameBDBM50370589
Synonyms:MOXALACTAM | Moxam
TypeSmall organic molecule
Emp. Form.C20H20N6O9S
Mol. Mass.520.473
SMILESCO[C@]1(NC(=O)C(C(O)=O)c2ccc(O)cc2)[C@H]2OCC(CSc3nnnn3C)=C(N2C1=O)C(O)=O