Reaction Details
TargetSolute carrier family 15 member 1
LigandBDBM50169198
Substrate/Competitorn/a
Meas. Tech.ChEMBL_838254 (CHEMBL2076202)
Ki 22000000±n/a nM
Citation Luckner, PBrandsch, M Interaction of 31 beta-lactam antibiotics with the H+/peptide symporter PEPT2: analysis of affinity constants and comparison with PEPT1. Eur J Pharm Biopharm59:17-24 (2004) 
 
Solute carrier family 15 member 1
Name:Solute carrier family 15 member 1
Type:PROTEIN
Mol. Mass.:78818.07
Organism:Homo sapiens (Human)
Description:ChEMBL_1488839
Residue:708
BDBM50169198
NameBDBM50169198
Synonyms:[2-(7-{2-(2-Amino-thiazol-4-yl)-2-[(Z)-methoxyimino]-acetylamino}-2-carboxy-8-oxo-5-thia-1-aza-bicyclo[4.2.0]oct-2-en-3-ylmethylsulfanyl)-5-methyl-thiazol-4-yl]-acetic acid anion
TypeSmall organic molecule
Emp. Form.C20H18N6O7S4
Mol. Mass.582.654
SMILESCO\N=C(/C(=O)NC1C2SCC(CSc3nc(CC([O-])=O)c(C)s3)=C(N2C1=O)C([O-])=O)c1csc(N)n1