Reaction Details
TargetSolute carrier family 15 member 1
LigandBDBM50350476
Substrate/Competitorn/a
Meas. Tech.ChEMBL_838254 (CHEMBL2076202)
Ki 7200000±n/a nM
Citation Luckner, PBrandsch, M Interaction of 31 beta-lactam antibiotics with the H+/peptide symporter PEPT2: analysis of affinity constants and comparison with PEPT1. Eur J Pharm Biopharm59:17-24 (2004) 
 
Solute carrier family 15 member 1
Name:Solute carrier family 15 member 1
Type:PROTEIN
Mol. Mass.:78818.07
Organism:Homo sapiens (Human)
Description:ChEMBL_1488839
Residue:708
BDBM50350476
NameBDBM50350476
Synonyms:BRL-1702 | DICLOXACILLIN
TypeSmall organic molecule
Emp. Form.C19H17Cl2N3O5S
Mol. Mass.470.326
SMILESCc1onc(c1C(=O)N[C@H]1[C@H]2SC(C)(C)[C@@H](N2C1=O)C(O)=O)-c1c(Cl)cccc1Cl