Reaction Details
TargetSolute carrier family 15 member 2
LigandBDBM50370592
Substrate/Competitorn/a
Meas. Tech.ChEMBL_838253 (CHEMBL2076201)
Ki>10000000±n/a nM
Citation Luckner, PBrandsch, M Interaction of 31 beta-lactam antibiotics with the H+/peptide symporter PEPT2: analysis of affinity constants and comparison with PEPT1. Eur J Pharm Biopharm59:17-24 (2004) 
 
Solute carrier family 15 member 2
Name:Solute carrier family 15 member 2
Type:PROTEIN
Mol. Mass.:81331.63
Organism:Rattus norvegicus
Description:ChEMBL_838253
Residue:729
BDBM50370592
NameBDBM50370592
Synonyms:CEPHAPIRIN Cefadyl | Cefapirin
TypeSmall organic molecule
Emp. Form.C17H17N3O6S2
Mol. Mass.423.463
SMILESCC(=O)OCC1=C(N2[C@H](SC1)[C@H](NC(=O)CSc1ccncc1)C2=O)C(O)=O