Reaction Details
TargetSolute carrier family 15 member 2
LigandBDBM50420258
Substrate/Competitorn/a
Meas. Tech.ChEMBL_838253 (CHEMBL2076201)
Ki>30000000±n/a nM
Citation Luckner, PBrandsch, M Interaction of 31 beta-lactam antibiotics with the H+/peptide symporter PEPT2: analysis of affinity constants and comparison with PEPT1. Eur J Pharm Biopharm59:17-24 (2004) 
 
Solute carrier family 15 member 2
Name:Solute carrier family 15 member 2
Type:PROTEIN
Mol. Mass.:81331.63
Organism:Rattus norvegicus
Description:ChEMBL_838253
Residue:729
BDBM50420258
NameBDBM50420258
Synonyms:CEFSULODIN
TypeSmall organic molecule
Emp. Form.C22H21N4O8S2
Mol. Mass.533.554
SMILESNC(=O)c1cc[n+](CC2=C(N3[C@H](SC2)[C@H](NC(=O)C(c2ccccc2)S(O)(=O)=O)C3=O)C(O)=O)cc1