Reaction Details
TargetSolute carrier family 15 member 2
LigandBDBM50022788
Substrate/Competitorn/a
Meas. Tech.ChEMBL_838253 (CHEMBL2076201)
Ki 950000±n/a nM
Citation Luckner, PBrandsch, M Interaction of 31 beta-lactam antibiotics with the H+/peptide symporter PEPT2: analysis of affinity constants and comparison with PEPT1. Eur J Pharm Biopharm59:17-24 (2004) 
 
Solute carrier family 15 member 2
Name:Solute carrier family 15 member 2
Type:PROTEIN
Mol. Mass.:81331.63
Organism:Rattus norvegicus
Description:ChEMBL_838253
Residue:729
BDBM50022788
NameBDBM50022788
Synonyms:(2S,5R,6R)-6-(3-(2-chlorophenyl)-5-methylisoxazole-4-carboxamido)-3,3-dimethyl-7-oxo-4-thia-1-aza-bicyclo[3.2.0]heptane-2-carboxylic acid 6-{[3-(2-Chloro-phenyl)-5-methyl-isoxazole-4-carbonyl]-amino}-3,3-dimethyl-7-oxo-4-thia-1-aza-bicyclo[3.2.0]heptane-2-carboxylic acid CLOXAPEN cloxacillin
TypeSmall organic molecule
Emp. Form.C19H18ClN3O5S
Mol. Mass.435.881
SMILESCc1onc(c1C(=O)N[C@H]1[C@H]2SC(C)(C)[C@@H](N2C1=O)C(O)=O)-c1ccccc1Cl