Reaction Details
TargetAlpha-2B adrenergic receptor
LigandBDBM50417343
Substrate/Competitorn/a
Meas. Tech.ChEMBL_840150 (CHEMBL2090927)
EC50 1000±n/a nM
Citation Del Bello, FDiamanti, EGiannella, MMammoli, VMarchioro, CMattioli, LTitomanlio, FPiergentili, AQuaglia, WBenedetti, GVarrone, MPigini, M Low Doses of Allyphenyline and Cyclomethyline, Effective against Morphine Dependence, Elicit an Antidepressant-like Effect. ACS Med Chem Lett3:535-539 (2012) 
 
Alpha-2B adrenergic receptor
Name:Alpha-2B adrenergic receptor
Type:Enzyme
Mol. Mass.:49964.20
Organism:Homo sapiens (Human)
Description:P18089
Residue:450
BDBM50417343
NameBDBM50417343
Synonyms:CHEMBL1276140
TypeSmall organic molecule
Emp. Form.C14H18N2O
Mol. Mass.230.3055
SMILESC[C@H](Oc1ccccc1CC=C)C1=NCCN1