Reaction Details
Target5-hydroxytryptamine receptor 1A
LigandBDBM50420342
Substrate/Competitorn/a
Meas. Tech.ChEMBL_840143 (CHEMBL2090846)
Ki 5.8±n/a nM
Citation Del Bello, FDiamanti, EGiannella, MMammoli, VMarchioro, CMattioli, LTitomanlio, FPiergentili, AQuaglia, WBenedetti, GVarrone, MPigini, M Low Doses of Allyphenyline and Cyclomethyline, Effective against Morphine Dependence, Elicit an Antidepressant-like Effect. ACS Med Chem Lett3:535-539 (2012) 
 
5-hydroxytryptamine receptor 1A
Name:5-hydroxytryptamine receptor 1A
Type:n/a
Mol. Mass.:46122.49
Organism:Homo sapiens (Human)
Description:n/a
Residue:422
BDBM50420342
NameBDBM50420342
Synonyms:CHEMBL2089156
TypeSmall organic molecule
Emp. Form.C15H20N2O
Mol. Mass.244.3321
SMILESC[C@H](Oc1ccccc1CC1CC1)C1=NCCN1