Reaction Details
Target5-hydroxytryptamine receptor 1A
LigandBDBM21393
Substrate/Competitorn/a
Meas. Tech.ChEMBL_840143 (CHEMBL2090846)
Ki 3.4±n/a nM
Citation Del Bello, FDiamanti, EGiannella, MMammoli, VMarchioro, CMattioli, LTitomanlio, FPiergentili, AQuaglia, WBenedetti, GVarrone, MPigini, M Low Doses of Allyphenyline and Cyclomethyline, Effective against Morphine Dependence, Elicit an Antidepressant-like Effect. ACS Med Chem Lett3:535-539 (2012) 
 
5-hydroxytryptamine receptor 1A
Name:5-hydroxytryptamine receptor 1A
Type:n/a
Mol. Mass.:46122.49
Organism:Homo sapiens (Human)
Description:n/a
Residue:422
BDBM21393
NameBDBM21393
Synonyms:7-(dipropylamino)-5,6,7,8-tetrahydronaphthalen-1-ol 8-OH-DPAT 8-OH-DPAT,(-) CHEMBL1788118 CHEMBL56 US10562853, Compound 8-OH-DPAT cid_1220
Typeradiolabeled ligand
Emp. Form.C16H25NO
Mol. Mass.247.3758
SMILESCCCN(CCC)C1CCc2cccc(O)c2C1