Reaction Details
TargetSnake venom metalloproteinase BaP1
LigandBDBM50420351
Substrate/Competitorn/a
Meas. Tech.ChEMBL_840308 (CHEMBL2091265)
IC50 107600±n/a nM
Citation Villalta-Romero, FGortat, AHerrera, AEArguedas, RQuesada, Jde Melo, RLCalvete, JJMontero, MMurillo, RRucavado, AGutiérrez, JMPérez-Payá, E Identification of new snake venom metalloproteinase inhibitors using compound screening and rational Peptide design. ACS Med Chem Lett3:540-543 (2012) 
 
Snake venom metalloproteinase BaP1
Name:Snake venom metalloproteinase BaP1
Type:PROTEIN
Mol. Mass.:45929.07
Organism:Bothrops asper
Description:ChEMBL_840308
Residue:408
BDBM50420351
NameBDBM50420351
Synonyms:CHEMBL2089173
TypeSmall organic molecule
Emp. Form.C21H30N6O4
Mol. Mass.430.5007
SMILESCC(C)C[C@H](NC(=O)[C@@H](N)Cc1ccccc1)C(=O)N[C@@H](Cc1cnc[nH]1)C(=O)NO