Reaction Details
TargetMetabotropic glutamate receptor 5
LigandBDBM50345562
Substrate/Competitorn/a
Meas. Tech.ChEMBL_840310 (CHEMBL2091267)
Ki 0.67±n/a nM
Citation Keck, TMZou, MFZhang, PRutledge, RPNewman, AH Metabotropic glutamate receptor 5 negative allosteric modulators as novel tools for in vivo investigation. ACS Med Chem Lett3:544-549 (2012) 
 
Metabotropic glutamate receptor 5
Name:Metabotropic glutamate receptor 5
Type:Enzyme
Mol. Mass.:131900.14
Organism:Rattus norvegicus (Rat)
Description:P31424
Residue:1203
BDBM50345562
NameBDBM50345562
Synonyms:3-(2-(6-methylpyridin-2-yl)ethynyl)-5-fluorobenzonitrile | CHEMBL1784608
TypeSmall organic molecule
Emp. Form.C15H9FN2
Mol. Mass.236.2438
SMILESCc1cccc(n1)C#Cc1cc(F)cc(c1)C#N