Reaction Details
TargetMetabotropic glutamate receptor 5
LigandBDBM50420362
Substrate/Competitorn/a
Meas. Tech.ChEMBL_840310 (CHEMBL2091267)
Ki 2.7±n/a nM
Citation Keck, TMZou, MFZhang, PRutledge, RPNewman, AH Metabotropic glutamate receptor 5 negative allosteric modulators as novel tools for in vivo investigation. ACS Med Chem Lett3:544-549 (2012) 
 
Metabotropic glutamate receptor 5
Name:Metabotropic glutamate receptor 5
Type:Enzyme
Mol. Mass.:131900.14
Organism:Rattus norvegicus (Rat)
Description:P31424
Residue:1203
BDBM50420362
NameBDBM50420362
Synonyms:CHEMBL2089182
TypeSmall organic molecule
Emp. Form.C15H6FN3
Mol. Mass.247.2266
SMILESFc1cc(cc(c1)C#Cc1cccc(n1)C#N)C#N