Reaction Details
TargetRicin
LigandBDBM50420403
Substrate/Competitorn/a
Meas. Tech.ChEMBL_840713 (CHEMBL2090455)
IC50 180000±n/a nM
Citation Pruet, JMSaito, RManzano, LAJasheway, KRWiget, PAKamat, IAnslyn, EVRobertus, JD Optimized 5-membered heterocycle-linked pterins for the inhibition of Ricin Toxin A. ACS Med Chem Lett3:588-591 (2012) 
 
Ricin
Name:Ricin
Synonyms:RICI_RICCO
Type:PROTEIN
Mol. Mass.:64090.82
Organism:Ricinus communis
Description:ChEMBL_1286970
Residue:576
BDBM50420403
NameBDBM50420403
Synonyms:CHEMBL2089309
TypeSmall organic molecule
Emp. Form.C13H12N6O2S
Mol. Mass.316.338
SMILESNc1nc2nc(cnc2c(=O)[nH]1)C(=O)NCCc1cccs1