Reaction Details
TargetRicin
LigandBDBM50420404
Substrate/Competitorn/a
Meas. Tech.ChEMBL_840713 (CHEMBL2090455)
IC50 70000±n/a nM
Citation Pruet, JMSaito, RManzano, LAJasheway, KRWiget, PAKamat, IAnslyn, EVRobertus, JD Optimized 5-membered heterocycle-linked pterins for the inhibition of Ricin Toxin A. ACS Med Chem Lett3:588-591 (2012) 
 
Ricin
Name:Ricin
Synonyms:RICI_RICCO
Type:PROTEIN
Mol. Mass.:64090.82
Organism:Ricinus communis
Description:ChEMBL_1286970
Residue:576
BDBM50420404
NameBDBM50420404
Synonyms:CHEMBL2089311
TypeSmall organic molecule
Emp. Form.C10H9N9O2
Mol. Mass.287.2376
SMILESNc1nc2nc(cnc2c(=O)[nH]1)C(=O)NCc1cnn[nH]1