Reaction Details
TargetRicin
LigandBDBM50420415
Substrate/Competitorn/a
Meas. Tech.ChEMBL_840713 (CHEMBL2090455)
IC50 150000±n/a nM
Citation Pruet, JMSaito, RManzano, LAJasheway, KRWiget, PAKamat, IAnslyn, EVRobertus, JD Optimized 5-membered heterocycle-linked pterins for the inhibition of Ricin Toxin A. ACS Med Chem Lett3:588-591 (2012) 
 
Ricin
Name:Ricin
Synonyms:RICI_RICCO
Type:PROTEIN
Mol. Mass.:64090.82
Organism:Ricinus communis
Description:ChEMBL_1286970
Residue:576
BDBM50420415
NameBDBM50420415
Synonyms:CHEMBL2086423
TypeSmall organic molecule
Emp. Form.C18H17N9O2
Mol. Mass.391.3867
SMILESNc1nc2nc(cnc2c(=O)[nH]1)C(=O)NCc1cn(CCc2ccccc2)nn1