Reaction Details
TargetNeuronal acetylcholine receptor subunit alpha-3
LigandBDBM50420606
Substrate/Competitorn/a
Meas. Tech.ChEMBL_842058 (CHEMBL2091475)
IC50 3900±n/a nM
Citation Zanaletti, RBettinetti, LCastaldo, CCocconcelli, GComery, TDunlop, JGaviraghi, GGhiron, CHaydar, SNJow, FMaccari, LMicco, INencini, AScali, CTurlizzi, EValacchi, M Discovery of a novel alpha-7 nicotinic acetylcholine receptor agonist series and characterization of the potent, selective, and orally efficacious agonist 5-(4-acetyl[1,4]diazepan-1-yl)pentanoic acid [5-(4-methoxyphenyl)-1H-pyrazol-3-yl] amide (SEN15924, WAY-361789). J Med Chem55:4806-23 (2012) 
 
Neuronal acetylcholine receptor subunit alpha-3
Name:Neuronal acetylcholine receptor subunit alpha-3
Type:Enzyme Catalytic Domain
Mol. Mass.:57479.03
Organism:Homo sapiens (Human)
Description:Cholinergic, Nicotinic Alpha3Beta2 0 HUMAN::P32297
Residue:505
BDBM50420606
NameBDBM50420606
Synonyms:CHEMBL2087447
TypeSmall organic molecule
Emp. Form.C19H25FN4O
Mol. Mass.344.4264
SMILESFc1ccc(cc1)-c1cc(NC(=O)CCCCN2CCCCC2)[nH]n1