Reaction Details
TargetPhosphatidylinositol 4,5-bisphosphate 3-kinase catalytic subunit gamma isoform
LigandBDBM50420714
Substrate/Competitorn/a
Meas. Tech.ChEMBL_842420 (CHEMBL2092093)
Ki 179±n/a nM
Citation Martínez González, SHernández, AIVarela, CRodríguez-Arístegui, SLorenzo, MRodríguez, ARivero, VMartín, JISaluste, CGRamos-Lima, FCendón, ECebrián, DAguirre, EGomez-Casero, EAlbarrán, MAlfonso, PGarcía-Serelde, BOyarzabal, JRabal, OMulero, FGonzalez-Granda, TLink, WFominaya, JBarbacid, MBischoff, JRPizcueta, PPastor, J Identification of ETP-46321, a potent and orally bioavailable PI3Ka,d inhibitor. Bioorg Med Chem Lett22:3460-6 (2012) 
 
Phosphatidylinositol 4,5-bisphosphate 3-kinase catalytic subunit gamma isoform
Name:Phosphatidylinositol 4,5-bisphosphate 3-kinase catalytic subunit gamma isoform
Type:Enzyme Subunit
Mol. Mass.:126470.30
Organism:Homo sapiens (Human)
Description:P48736
Residue:1102
BDBM50420714
NameBDBM50420714
Synonyms:CHEMBL2087474
TypeSmall organic molecule
Emp. Form.C20H27N9O3S
Mol. Mass.473.552
SMILESCS(=O)(=O)N1CCN(Cc2cn3cc(nc(N4CCOCC4)c3n2)-c2cnc(N)nc2)CC1