Reaction Details
TargetDelta-type opioid receptor
LigandBDBM50400870
Substrate/Competitorn/a
Meas. Tech.ChEMBL_839813 (CHEMBL2089824)
Ki>400±n/a nM
Citation Pedregal, CJoshi, EMToledo, MALafuente, CDiaz, NMartinez-Grau, MAJiménez, ABenito, ANavarro, AChen, ZMudra, DRKahl, SDRash, KSStatnick, MABarth, VN Development of LC-MS/MS-based receptor occupancy tracers and positron emission tomography radioligands for the nociceptin/orphanin FQ (NOP) receptor. J Med Chem55:4955-67 (2012) 
 
Delta-type opioid receptor
Name:Delta-type opioid receptor
Type:G Protein-Coupled Receptor (GPCR)
Mol. Mass.:40382.98
Organism:Homo sapiens (Human)
Description:Competition binding assays were carried out using membrane preparations from transfected HN9.10 cells that constitutively expressed the delta opioid receptor.
Residue:372
BDBM50400870
NameBDBM50400870
Synonyms:CHEMBL559569 | SB-612111
TypeSmall organic molecule
Emp. Form.C24H29Cl2NO
Mol. Mass.418.399
SMILESCc1cccc2C(O)CC(CN3CCC(CC3)c3c(Cl)cccc3Cl)CCc12