Reaction Details
TargetKappa-type opioid receptor
LigandBDBM50420808
Substrate/Competitorn/a
Meas. Tech.ChEMBL_839811 (CHEMBL2089822)
Ki>400±n/a nM
Citation Pedregal, CJoshi, EMToledo, MALafuente, CDiaz, NMartinez-Grau, MAJiménez, ABenito, ANavarro, AChen, ZMudra, DRKahl, SDRash, KSStatnick, MABarth, VN Development of LC-MS/MS-based receptor occupancy tracers and positron emission tomography radioligands for the nociceptin/orphanin FQ (NOP) receptor. J Med Chem55:4955-67 (2012) 
 
Kappa-type opioid receptor
Name:Kappa-type opioid receptor
Type:G Protein-Coupled Receptor (GPCR)
Mol. Mass.:42648.76
Organism:Homo sapiens (Human)
Description:P41145
Residue:380
BDBM50420808
NameBDBM50420808
Synonyms:CHEMBL2088041 | CHEMBL2088042
TypeSmall organic molecule
Emp. Form.C23H29ClN2O2S
Mol. Mass.433.007
SMILESCN(C)C(=O)C(CN1CCC2(CC1)OCCc1ccsc21)Cc1ccccc1Cl