Reaction Details
TargetKappa-type opioid receptor
LigandBDBM50400870
Substrate/Competitorn/a
Meas. Tech.ChEMBL_839811 (CHEMBL2089822)
Ki>400±n/a nM
Citation Pedregal, CJoshi, EMToledo, MALafuente, CDiaz, NMartinez-Grau, MAJiménez, ABenito, ANavarro, AChen, ZMudra, DRKahl, SDRash, KSStatnick, MABarth, VN Development of LC-MS/MS-based receptor occupancy tracers and positron emission tomography radioligands for the nociceptin/orphanin FQ (NOP) receptor. J Med Chem55:4955-67 (2012) 
 
Kappa-type opioid receptor
Name:Kappa-type opioid receptor
Type:G Protein-Coupled Receptor (GPCR)
Mol. Mass.:42648.76
Organism:Homo sapiens (Human)
Description:P41145
Residue:380
BDBM50400870
NameBDBM50400870
Synonyms:CHEMBL559569 | SB-612111
TypeSmall organic molecule
Emp. Form.C24H29Cl2NO
Mol. Mass.418.399
SMILESCc1cccc2C(O)CC(CN3CCC(CC3)c3c(Cl)cccc3Cl)CCc12