Reaction Details
TargetKappa-type opioid receptor
LigandBDBM50420801
Substrate/Competitorn/a
Meas. Tech.ChEMBL_839811 (CHEMBL2089822)
Ki>400±n/a nM
Citation Pedregal, CJoshi, EMToledo, MALafuente, CDiaz, NMartinez-Grau, MAJiménez, ABenito, ANavarro, AChen, ZMudra, DRKahl, SDRash, KSStatnick, MABarth, VN Development of LC-MS/MS-based receptor occupancy tracers and positron emission tomography radioligands for the nociceptin/orphanin FQ (NOP) receptor. J Med Chem55:4955-67 (2012) 
 
Kappa-type opioid receptor
Name:Kappa-type opioid receptor
Type:G Protein-Coupled Receptor (GPCR)
Mol. Mass.:42648.76
Organism:Homo sapiens (Human)
Description:P41145
Residue:380
BDBM50420801
NameBDBM50420801
Synonyms:CHEMBL2088035
TypeSmall organic molecule
Emp. Form.C27H28N4O2
Mol. Mass.440.5368
SMILESCNC(=O)Cn1c2ccccc2n(C2CCN(CC2)[C@@H]2Cc3cccc4cccc2c34)c1=O