Reaction Details
TargetMu-type opioid receptor
LigandBDBM50420810
Substrate/Competitorn/a
Meas. Tech.ChEMBL_839812 (CHEMBL2089823)
Ki>400±n/a nM
Citation Pedregal, CJoshi, EMToledo, MALafuente, CDiaz, NMartinez-Grau, MAJiménez, ABenito, ANavarro, AChen, ZMudra, DRKahl, SDRash, KSStatnick, MABarth, VN Development of LC-MS/MS-based receptor occupancy tracers and positron emission tomography radioligands for the nociceptin/orphanin FQ (NOP) receptor. J Med Chem55:4955-67 (2012) 
 
Mu-type opioid receptor
Name:Mu-type opioid receptor
Type:G Protein-Coupled Receptor (GPCR)
Mol. Mass.:44789.51
Organism:Homo sapiens (Human)
Description:P35372
Residue:400
BDBM50420810
NameBDBM50420810
Synonyms:CHEMBL2088060
TypeSmall organic molecule
Emp. Form.C23H28F2N2O2S
Mol. Mass.434.542
SMILESCN(C)C(=O)[C@H](CN1CCC2(CC1)OCCc1cc(F)sc21)Cc1ccccc1F