Reaction Details
TargetMu-type opioid receptor
LigandBDBM50420805
Substrate/Competitorn/a
Meas. Tech.ChEMBL_839812 (CHEMBL2089823)
Ki>400±n/a nM
Citation Pedregal, CJoshi, EMToledo, MALafuente, CDiaz, NMartinez-Grau, MAJiménez, ABenito, ANavarro, AChen, ZMudra, DRKahl, SDRash, KSStatnick, MABarth, VN Development of LC-MS/MS-based receptor occupancy tracers and positron emission tomography radioligands for the nociceptin/orphanin FQ (NOP) receptor. J Med Chem55:4955-67 (2012) 
 
Mu-type opioid receptor
Name:Mu-type opioid receptor
Type:G Protein-Coupled Receptor (GPCR)
Mol. Mass.:44789.51
Organism:Homo sapiens (Human)
Description:P35372
Residue:400
BDBM50420805
NameBDBM50420805
Synonyms:CHEMBL2088052
TypeSmall organic molecule
Emp. Form.C23H28Cl2N2O2S
Mol. Mass.467.452
SMILESCN(C)C(=O)C(CN1CCC2(CC1)OCCc1cc(Cl)sc21)Cc1ccccc1Cl