Reaction Details
TargetNociceptin receptor
LigandBDBM50420807
Substrate/Competitorn/a
Meas. Tech.ChEMBL_839690 (CHEMBL2090804)
Ki 5.2±n/a nM
Citation Pedregal, CJoshi, EMToledo, MALafuente, CDiaz, NMartinez-Grau, MAJiménez, ABenito, ANavarro, AChen, ZMudra, DRKahl, SDRash, KSStatnick, MABarth, VN Development of LC-MS/MS-based receptor occupancy tracers and positron emission tomography radioligands for the nociceptin/orphanin FQ (NOP) receptor. J Med Chem55:4955-67 (2012) 
 
Nociceptin receptor
Name:Nociceptin receptor
Type:G Protein-Coupled Receptor (GPCR)
Mol. Mass.:40702.87
Organism:Homo sapiens (Human)
Description:P41146
Residue:370
BDBM50420807
NameBDBM50420807
Synonyms:CHEMBL2088043
TypeSmall organic molecule
Emp. Form.C23H29FN2O2S
Mol. Mass.416.552
SMILESCN(C)C(=O)C(CN1CCC2(CC1)OCCc1ccsc21)Cc1ccccc1F