Reaction Details
TargetCannabinoid receptor 1
LigandBDBM50420892
Substrate/Competitorn/a
Meas. Tech.ChEMBL_840018 (CHEMBL2090508)
Ki 3915±n/a nM
Citation Pasquini, SMugnaini, CLigresti, ATafi, ABrogi, SFalciani, CPedani, VPesco, NGuida, FLuongo, LVarani, KBorea, PAMaione, SDi Marzo, VCorelli, F Design, synthesis, and pharmacological characterization of indol-3-ylacetamides, indol-3-yloxoacetamides, and indol-3-ylcarboxamides: potent and selective CB2 cannabinoid receptor inverse agonists. J Med Chem55:5391-402 (2012) 
 
Cannabinoid receptor 1
Name:Cannabinoid receptor 1
Type:G Protein-Coupled Receptor (GPCR)
Mol. Mass.:52868.96
Organism:Homo sapiens (Human)
Description:P21554
Residue:472
BDBM50420892
NameBDBM50420892
Synonyms:CHEMBL2087102
TypeSmall organic molecule
Emp. Form.C29H30N2O2
Mol. Mass.438.5607
SMILESC=CCn1cc(C(=O)C(=O)NC23CC4CC(CC(C4)C2)C3)c2cc(ccc12)-c1ccccc1