Reaction Details
TargetCannabinoid receptor 2
LigandBDBM50420889
Substrate/Competitorn/a
Meas. Tech.ChEMBL_840019 (CHEMBL2090509)
Ki 189±n/a nM
Citation Pasquini, SMugnaini, CLigresti, ATafi, ABrogi, SFalciani, CPedani, VPesco, NGuida, FLuongo, LVarani, KBorea, PAMaione, SDi Marzo, VCorelli, F Design, synthesis, and pharmacological characterization of indol-3-ylacetamides, indol-3-yloxoacetamides, and indol-3-ylcarboxamides: potent and selective CB2 cannabinoid receptor inverse agonists. J Med Chem55:5391-402 (2012) 
 
Cannabinoid receptor 2
Name:Cannabinoid receptor 2
Type:G Protein-Coupled Receptor (GPCR)
Mol. Mass.:39690.94
Organism:Homo sapiens (Human)
Description:P34972
Residue:360
BDBM50420889
NameBDBM50420889
Synonyms:CHEMBL2087098
TypeSmall organic molecule
Emp. Form.C33H34N2O
Mol. Mass.474.6359
SMILESO=C(Cc1cn(Cc2ccccc2)c2ccc(cc12)-c1ccccc1)NC12CC3CC(CC(C3)C1)C2