Reaction Details
TargetCannabinoid receptor 2
LigandBDBM50420893
Substrate/Competitorn/a
Meas. Tech.ChEMBL_840019 (CHEMBL2090509)
Ki 11.2±n/a nM
Citation Pasquini, SMugnaini, CLigresti, ATafi, ABrogi, SFalciani, CPedani, VPesco, NGuida, FLuongo, LVarani, KBorea, PAMaione, SDi Marzo, VCorelli, F Design, synthesis, and pharmacological characterization of indol-3-ylacetamides, indol-3-yloxoacetamides, and indol-3-ylcarboxamides: potent and selective CB2 cannabinoid receptor inverse agonists. J Med Chem55:5391-402 (2012) 
 
Cannabinoid receptor 2
Name:Cannabinoid receptor 2
Type:G Protein-Coupled Receptor (GPCR)
Mol. Mass.:39690.94
Organism:Homo sapiens (Human)
Description:P34972
Residue:360
BDBM50420893
NameBDBM50420893
Synonyms:CHEMBL2087103
TypeSmall organic molecule
Emp. Form.C27H32N2O2
Mol. Mass.416.5552
SMILESCCCCCn1cc(C(=O)C(=O)NC2CCCCC2)c2cc(ccc12)-c1ccccc1