Reaction Details
TargetCannabinoid receptor 2
LigandBDBM50420895
Substrate/Competitorn/a
Meas. Tech.ChEMBL_840019 (CHEMBL2090509)
Ki 22.2±n/a nM
Citation Pasquini, SMugnaini, CLigresti, ATafi, ABrogi, SFalciani, CPedani, VPesco, NGuida, FLuongo, LVarani, KBorea, PAMaione, SDi Marzo, VCorelli, F Design, synthesis, and pharmacological characterization of indol-3-ylacetamides, indol-3-yloxoacetamides, and indol-3-ylcarboxamides: potent and selective CB2 cannabinoid receptor inverse agonists. J Med Chem55:5391-402 (2012) 
 
Cannabinoid receptor 2
Name:Cannabinoid receptor 2
Type:G Protein-Coupled Receptor (GPCR)
Mol. Mass.:39690.94
Organism:Homo sapiens (Human)
Description:P34972
Residue:360
BDBM50420895
NameBDBM50420895
Synonyms:CHEMBL2087105
TypeSmall organic molecule
Emp. Form.C28H30N2O2
Mol. Mass.426.55
SMILESOc1ccc(cc1)-c1ccc2n(CC=C)cc(C(=O)NC34CC5CC(CC(C5)C3)C4)c2c1