Reaction Details
TargetTranslocator protein
LigandBDBM50421100
Substrate/Competitorn/a
Meas. Tech.ChEMBL_842489 (CHEMBL2092214)
Ki 9±n/a nM
Citation Fukaya, TKodo, TIshiyama, TKakuyama, HNishikawa, HBaba, SMasumoto, S Design, synthesis and structure-activity relationships of novel benzoxazolone derivatives as 18 kDa translocator protein (TSPO) ligands. Bioorg Med Chem20:5568-82 (2012) 
 
Translocator protein
Name:Translocator protein
Type:Mitochondrion membrane protein
Mol. Mass.:18945.84
Organism:Rattus norvegicus (rat)
Description:Competitive binding experiments were performed on rat kidney mitochondrial membranes.
Residue:169
BDBM50421100
NameBDBM50421100
Synonyms:CHEMBL2088358
TypeSmall organic molecule
Emp. Form.C22H18N2O3
Mol. Mass.358.3899
SMILESCN(C(=O)Cn1c2cccc(-c3ccccc3)c2oc1=O)c1ccccc1