Reaction Details
TargetTranslocator protein
LigandBDBM50421111
Substrate/Competitorn/a
Meas. Tech.ChEMBL_842489 (CHEMBL2092214)
Ki 12±n/a nM
Citation Fukaya, TKodo, TIshiyama, TKakuyama, HNishikawa, HBaba, SMasumoto, S Design, synthesis and structure-activity relationships of novel benzoxazolone derivatives as 18 kDa translocator protein (TSPO) ligands. Bioorg Med Chem20:5568-82 (2012) 
 
Translocator protein
Name:Translocator protein
Type:Mitochondrion membrane protein
Mol. Mass.:18945.84
Organism:Rattus norvegicus (rat)
Description:Competitive binding experiments were performed on rat kidney mitochondrial membranes.
Residue:169
BDBM50421111
NameBDBM50421111
Synonyms:CHEMBL2088369
TypeSmall organic molecule
Emp. Form.C25H25N3O3
Mol. Mass.415.4843
SMILESCN(C)Cc1cccc(c1)N(C)C(=O)Cn1c2cc(ccc2oc1=O)-c1ccccc1