Reaction Details
TargetTranslocator protein
LigandBDBM50421121
Substrate/Competitorn/a
Meas. Tech.ChEMBL_842489 (CHEMBL2092214)
Ki 5.3±n/a nM
Citation Fukaya, TKodo, TIshiyama, TKakuyama, HNishikawa, HBaba, SMasumoto, S Design, synthesis and structure-activity relationships of novel benzoxazolone derivatives as 18 kDa translocator protein (TSPO) ligands. Bioorg Med Chem20:5568-82 (2012) 
 
Translocator protein
Name:Translocator protein
Type:Mitochondrion membrane protein
Mol. Mass.:18945.84
Organism:Rattus norvegicus (rat)
Description:Competitive binding experiments were performed on rat kidney mitochondrial membranes.
Residue:169
BDBM50421121
NameBDBM50421121
Synonyms:CHEMBL2088542
TypeSmall organic molecule
Emp. Form.C21H17N3O3
Mol. Mass.359.378
SMILESCN(C(=O)Cn1c2cc(ccc2oc1=O)-c1ccncc1)c1ccccc1