Reaction Details
TargetXanthine dehydrogenase/oxidase
LigandBDBM50421151
Substrate/Competitorn/a
Meas. Tech.ChEMBL_839550 (CHEMBL2090357)
IC50 5300±n/a nM
Citation Bandgar, BPAdsul, LKChavan, HVShringare, SNKorbad, BLJalde, SSLonikar, SVNile, SHShirfule, AL Synthesis, biological evaluation, and molecular docking of N-{3-[3-(9-methyl-9H-carbazol-3-yl)-acryloyl]-phenyl}-benzamide/amide derivatives as xanthine oxidase and tyrosinase inhibitors. Bioorg Med Chem20:5649-57 (2012) 
 
Xanthine dehydrogenase/oxidase
Name:Xanthine dehydrogenase/oxidase
Type:Protein
Mol. Mass.:146809.00
Organism:Bos taurus (Bovine)
Description:P80457
Residue:1332
BDBM50421151
NameBDBM50421151
Synonyms:CHEMBL2088602
TypeSmall organic molecule
Emp. Form.C30H24N2O2
Mol. Mass.444.5238
SMILESCc1ccc(cc1)C(=O)Nc1cccc(c1)C(=O)\C=C\c1ccc2n(C)c3ccccc3c2c1