Reaction Details
TargetXanthine dehydrogenase/oxidase
LigandBDBM50421156
Substrate/Competitorn/a
Meas. Tech.ChEMBL_839550 (CHEMBL2090357)
IC50 5100±n/a nM
Citation Bandgar, BPAdsul, LKChavan, HVShringare, SNKorbad, BLJalde, SSLonikar, SVNile, SHShirfule, AL Synthesis, biological evaluation, and molecular docking of N-{3-[3-(9-methyl-9H-carbazol-3-yl)-acryloyl]-phenyl}-benzamide/amide derivatives as xanthine oxidase and tyrosinase inhibitors. Bioorg Med Chem20:5649-57 (2012) 
 
Xanthine dehydrogenase/oxidase
Name:Xanthine dehydrogenase/oxidase
Type:Protein
Mol. Mass.:146809.00
Organism:Bos taurus (Bovine)
Description:P80457
Residue:1332
BDBM50421156
NameBDBM50421156
Synonyms:CHEMBL2088607
TypeSmall organic molecule
Emp. Form.C31H24N2O2
Mol. Mass.456.5345
SMILESCn1c2ccccc2c2cc(\C=C\C(=O)c3cccc(NC(=O)\C=C\c4ccccc4)c3)ccc12