Reaction Details
TargetXanthine dehydrogenase/oxidase
LigandBDBM50421157
Substrate/Competitorn/a
Meas. Tech.ChEMBL_839550 (CHEMBL2090357)
IC50 4300±n/a nM
Citation Bandgar, BPAdsul, LKChavan, HVShringare, SNKorbad, BLJalde, SSLonikar, SVNile, SHShirfule, AL Synthesis, biological evaluation, and molecular docking of N-{3-[3-(9-methyl-9H-carbazol-3-yl)-acryloyl]-phenyl}-benzamide/amide derivatives as xanthine oxidase and tyrosinase inhibitors. Bioorg Med Chem20:5649-57 (2012) 
 
Xanthine dehydrogenase/oxidase
Name:Xanthine dehydrogenase/oxidase
Type:Protein
Mol. Mass.:146809.00
Organism:Bos taurus (Bovine)
Description:P80457
Residue:1332
BDBM50421157
NameBDBM50421157
Synonyms:CHEMBL2088608
TypeSmall organic molecule
Emp. Form.C26H22N2O2
Mol. Mass.394.4651
SMILESCn1c2ccccc2c2cc(\C=C\C(=O)c3cccc(NC(=O)C4CC4)c3)ccc12