Reaction Details
TargetPolyphenol oxidase 2
LigandBDBM50421158
Substrate/Competitorn/a
Meas. Tech.ChEMBL_839551 (CHEMBL2090358)
IC50 80150±n/a nM
Citation Bandgar, BPAdsul, LKChavan, HVShringare, SNKorbad, BLJalde, SSLonikar, SVNile, SHShirfule, AL Synthesis, biological evaluation, and molecular docking of N-{3-[3-(9-methyl-9H-carbazol-3-yl)-acryloyl]-phenyl}-benzamide/amide derivatives as xanthine oxidase and tyrosinase inhibitors. Bioorg Med Chem20:5649-57 (2012) 
 
Polyphenol oxidase 2
Name:Polyphenol oxidase 2
Type:Protein
Mol. Mass.:63923.66
Organism:Agaricus bisporus (Common mushroom)
Description:O42713
Residue:556
BDBM50421158
NameBDBM50421158
Synonyms:CHEMBL2088609
TypeSmall organic molecule
Emp. Form.C24H20N2O2
Mol. Mass.368.4278
SMILESCC(=O)Nc1cccc(c1)C(=O)\C=C\c1ccc2n(C)c3ccccc3c2c1