Reaction Details
TargetPolyphenol oxidase 2
LigandBDBM50421154
Substrate/Competitorn/a
Meas. Tech.ChEMBL_839553 (CHEMBL2090360)
IC50 60280±n/a nM
Citation Bandgar, BPAdsul, LKChavan, HVShringare, SNKorbad, BLJalde, SSLonikar, SVNile, SHShirfule, AL Synthesis, biological evaluation, and molecular docking of N-{3-[3-(9-methyl-9H-carbazol-3-yl)-acryloyl]-phenyl}-benzamide/amide derivatives as xanthine oxidase and tyrosinase inhibitors. Bioorg Med Chem20:5649-57 (2012) 
 
Polyphenol oxidase 2
Name:Polyphenol oxidase 2
Type:Protein
Mol. Mass.:63923.66
Organism:Agaricus bisporus (Common mushroom)
Description:O42713
Residue:556
BDBM50421154
NameBDBM50421154
Synonyms:CHEMBL2088605
TypeSmall organic molecule
Emp. Form.C27H20N2O3
Mol. Mass.420.4593
SMILESCn1c2ccccc2c2cc(\C=C\C(=O)c3cccc(NC(=O)c4ccco4)c3)ccc12