Reaction Details
TargetPolyphenol oxidase 2
LigandBDBM50421157
Substrate/Competitorn/a
Meas. Tech.ChEMBL_839553 (CHEMBL2090360)
IC50 74450±n/a nM
Citation Bandgar, BPAdsul, LKChavan, HVShringare, SNKorbad, BLJalde, SSLonikar, SVNile, SHShirfule, AL Synthesis, biological evaluation, and molecular docking of N-{3-[3-(9-methyl-9H-carbazol-3-yl)-acryloyl]-phenyl}-benzamide/amide derivatives as xanthine oxidase and tyrosinase inhibitors. Bioorg Med Chem20:5649-57 (2012) 
 
Polyphenol oxidase 2
Name:Polyphenol oxidase 2
Type:Protein
Mol. Mass.:63923.66
Organism:Agaricus bisporus (Common mushroom)
Description:O42713
Residue:556
BDBM50421157
NameBDBM50421157
Synonyms:CHEMBL2088608
TypeSmall organic molecule
Emp. Form.C26H22N2O2
Mol. Mass.394.4651
SMILESCn1c2ccccc2c2cc(\C=C\C(=O)c3cccc(NC(=O)C4CC4)c3)ccc12