Reaction Details
Target5-hydroxytryptamine receptor 4
LigandBDBM82505
Substrate/Competitorn/a
Meas. Tech.ChEBML_201061
IC50 0.079433±n/a nM
Citation  TBA Bioorg Med Chem Lett4:667-668 (1994)    Article
 
5-hydroxytryptamine receptor 4
Name:5-hydroxytryptamine receptor 4
Type:Enzyme Catalytic Domain
Mol. Mass.:43735.29
Organism:GUINEA PIG
Description:5-HT4 HTR4 GUINEA PIG::O70528
Residue:388
BDBM82505
NameBDBM82505
Synonyms:CAS_121881 SB204070
TypeSmall organic molecule
Emp. Form.C19H27ClN2O4
Mol. Mass.382.882
SMILESCCCCN1CCC(COC(=O)c2cc(Cl)c(N)c3OCCOc23)CC1