Reaction Details
Target5-hydroxytryptamine receptor 4
LigandBDBM50421359
Substrate/Competitorn/a
Meas. Tech.ChEBML_201061
IC50 0.100000±n/a nM
Citation  TBA Bioorg Med Chem Lett4:667-668 (1994)    Article
 
5-hydroxytryptamine receptor 4
Name:5-hydroxytryptamine receptor 4
Type:Enzyme Catalytic Domain
Mol. Mass.:43735.29
Organism:GUINEA PIG
Description:5-HT4 HTR4 GUINEA PIG::O70528
Residue:388
BDBM50421359
NameBDBM50421359
Synonyms:CHEMBL145075
TypeSmall organic molecule
Emp. Form.C21H28N2O3
Mol. Mass.356.4586
SMILESCCCCN1CCC(COC(=O)c2c3OCCn3c3ccccc23)CC1