Reaction Details
TargetIntegrin alpha-IIb/beta-3
LigandBDBM50421448
Substrate/Competitorn/a
Meas. Tech.ChEMBL_70360 (CHEMBL677185)
IC50 110±n/a nM
Citation Miyashita, MAkamatsu, MHayashi, YUeno, T Three-dimensional quantitative structure-activity relationship analyses of RGD mimetics as fibrinogen receptor antagonists. Bioorg Med Chem Lett10:859-63 (2000) Integrin alpha-IIb/beta-3
Name:Integrin alpha-IIb/beta-3
Synonyms:Glycoprotein IIb/IIIa
Type:n/a
Mol. Mass.:n/a
Description:ASSAY_ID of EBI is 30109
Components:This complex has 2 components.
Component 1
Name:Integrin beta-3
Type:Protein
Mol. Mass.:87038.91
Organism:Homo sapiens (Human)
Description:P05106
Residue:788
Component 2
Name:Integrin alpha-IIb
Synonyms:CD_antigen=CD41 GPIIb Glycoprotein IIb ITGA2B Integrin alpha-IIb heavy chain Integrin alpha-IIb light chain, form 2 Integrin alpha-V/beta-3 and alpha-IIb/beta 3 | Platelet membrane glycoprotein IIb
Type:Protein
Mol. Mass.:113354.85
Organism:Homo sapiens (Human)
Description:P08514
Residue:1039
BDBM50421448
NameBDBM50421448
Synonyms:CHEMBL172270
TypeSmall organic molecule
Emp. Form.C26H32N4O5
Mol. Mass.480.5561
SMILESCC(C)([C@H](NC(=O)c1ccc(cc1)C(N)=N)c1ccc(O)cc1)C(=O)N1CCC(CC(O)=O)CC1