Reaction Details
TargetAlpha-1A adrenergic receptor
LigandBDBM50421516
Substrate/Competitorn/a
Meas. Tech.ChEMBL_30096 (CHEMBL640032)
EC50 3.2±n/a nM
Citation Bishop, MJBerman, JBigham, ECGarrison, DTGobel, MJHodson, SJIrving, PELiacos, JAMinick, DJNavas, FSaussy, DLSpeake, JD 2-(Anilinomethyl)imidazolines as alpha(1)-adrenoceptor agonists: the identification of alpha(1A) subtype selective 2'-carboxylic acid esters and amides. Bioorg Med Chem Lett11:2871-4 (2001) Alpha-1A adrenergic receptor
Name:Alpha-1A adrenergic receptor
Type:Cell-surface receptors
Mol. Mass.:51511.67
Organism:Homo sapiens (Human)
Description:P35348
Residue:466
BDBM50421516
NameBDBM50421516
Synonyms:CHEMBL319553
TypeSmall organic molecule
Emp. Form.C14H19N3O2
Mol. Mass.261.3196
SMILESCC(C)OC(=O)c1ccccc1NCC1=NCCN1